Reaction Details
TargetDipeptidyl peptidase 4
LigandBDBM50242594
Substrate/Competitorn/a
Meas. Tech.ChEMBL_534536 (CHEMBL985439)
IC50 5.7±n/a nM
Citation Fukushima, HHiratate, ATakahashi, MMikami, ASaito-Hori, MMunetomo, EKitano, KChonan, SSaito, HSuzuki, ATakaoka, YYamamoto, K Synthesis and structure-activity relationships of potent 4-fluoro-2-cyanopyrrolidine dipeptidyl peptidase IV inhibitors. Bioorg Med Chem16:4093-106 (2008) 
 
Dipeptidyl peptidase 4
Name:Dipeptidyl peptidase 4
Type:Enzyme
Mol. Mass.:88271.01
Organism:Homo sapiens (Human)
Description:P27487
Residue:766
BDBM50242594
NameBDBM50242594
Synonyms:CHEMBL519585 | N-[2-({2-[(2S,4S)-2-Cyano-4-fluoropyrrolidin-1-yl]-2-oxoethyl}amino)-2-methylpropyl]-1H-benzimidazole-5-carboxamide
TypeSmall organic molecule
Emp. Form.C19H23FN6O2
Mol. Mass.386.4233
SMILESCC(C)(CNC(=O)c1ccc2nc[nH]c2c1)NCC(=O)N1C[C@@H](F)C[C@H]1C#N