Reaction Details
TargetDipeptidyl peptidase 4
LigandBDBM50242576
Substrate/Competitorn/a
Meas. Tech.ChEMBL_534536 (CHEMBL985439)
IC50 2.7±n/a nM
Citation Fukushima, HHiratate, ATakahashi, MMikami, ASaito-Hori, MMunetomo, EKitano, KChonan, SSaito, HSuzuki, ATakaoka, YYamamoto, K Synthesis and structure-activity relationships of potent 4-fluoro-2-cyanopyrrolidine dipeptidyl peptidase IV inhibitors. Bioorg Med Chem16:4093-106 (2008) 
 
Dipeptidyl peptidase 4
Name:Dipeptidyl peptidase 4
Type:Enzyme
Mol. Mass.:88271.01
Organism:Homo sapiens (Human)
Description:P27487
Residue:766
BDBM50242576
NameBDBM50242576
Synonyms:(2S,4S)-1-(N-{2-[(5-Chloropyridin-2-yl)amino]ethyl}-glycyl)-4-fluoropyrrolidine-2-carbonitrile | CHEMBL500008
TypeSmall organic molecule
Emp. Form.C14H17ClFN5O
Mol. Mass.325.769
SMILESF[C@H]1C[C@@H](C#N)N(C1)C(=O)CNCCNc1ccc(Cl)cn1