Reaction Details
TargetAdenosine receptor A1
LigandBDBM50207816
Substrate/Competitorn/a
Meas. Tech.ChEMBL_529841 (CHEMBL967544)
Ki 9±n/a nM
Citation Ishiyama, HOhshita, KAbe, TNakata, HKobayashi, J Synthesis of eudistomin D analogues and its effects on adenosine receptors. Bioorg Med Chem16:3825-30 (2008) 
 
Adenosine receptor A1
Name:Adenosine receptor A1
Type:G Protein-Coupled Receptor (GPCR)
Mol. Mass.:36520.92
Organism:Homo sapiens (Human)
Description:P30542
Residue:326
BDBM50207816
NameBDBM50207816
Synonyms:CHEMBL273094 N-(2-Amino-ethyl)-2-[4-(2,6-dioxo-1,3-dipropyl-2,3,6,7-tetrahydro-1H-purin-8-yl)-phenoxy]-acetamide (xanthine amine congenere, XAC) N-(2-Amino-ethyl)-2-[4-(2,6-dioxo-1,3-dipropyl-2,3,6,9-tetrahydro-1H-purin-8-yl)-phenoxy]-acetamide XAC
TypeSmall organic molecule
Emp. Form.C21H28N6O4
Mol. Mass.428.4848
SMILESCCCn1c2nc([nH]c2c(=O)n(CCC)c1=O)-c1ccc(OCC(=O)NCCN)cc1