Reaction Details
TargetHistamine H1 receptor
LigandBDBM22567
Substrate/Competitorn/a
Meas. Tech.ChEMBL_528531 (CHEMBL972066)
EC50 2.6±n/a nM
Citation Gafner, SDietz, BMMcPhail, KLScott, IMGlinski, JARussell, FEMcCollom, MMBudzinski, JWFoster, BCBergeron, CRhyu, MRBolton, JL Alkaloids from Eschscholzia californica and their capacity to inhibit binding of [3H]8-Hydroxy-2-(di-N-propylamino)tetralin to 5-HT1A receptors in Vitro. J Nat Prod69:432-5 (2006) 
 
Histamine H1 receptor
Name:Histamine H1 receptor
Type:G Protein-Coupled Receptor (GPCR)
Mol. Mass.:55808.72
Organism:Homo sapiens (Human)
Description:Cell pellets from SK-N-MC cells transfected with human H1 receptor were used in binding assay.
Residue:487
BDBM22567
NameBDBM22567
Synonyms:3H]pyrilamine Dorantamin N-(4-methoxybenzyl)-N ,N -dimethyl-N-pyridin-2-ylethane-1,2-diamine PYRILAMINE [3H]mepyramine | [3H]pyrilamine
Typeradiolabeled ligand
Emp. Form.C17H23N3O
Mol. Mass.285.384
SMILESCOc1ccc(CN(CCN(C)C)c2ccccn2)cc1