Reaction Details
Target5-hydroxytryptamine receptor 1A
LigandBDBM50250422
Substrate/Competitorn/a
Meas. Tech.ChEMBL_528532 (CHEMBL972067)
EC50 160±n/a nM
Citation Gafner, SDietz, BMMcPhail, KLScott, IMGlinski, JARussell, FEMcCollom, MMBudzinski, JWFoster, BCBergeron, CRhyu, MRBolton, JL Alkaloids from Eschscholzia californica and their capacity to inhibit binding of [3H]8-Hydroxy-2-(di-N-propylamino)tetralin to 5-HT1A receptors in Vitro. J Nat Prod69:432-5 (2006) 
 
5-hydroxytryptamine receptor 1A
Name:5-hydroxytryptamine receptor 1A
Type:n/a
Mol. Mass.:46122.49
Organism:Homo sapiens (Human)
Description:n/a
Residue:422
BDBM50250422
NameBDBM50250422
Synonyms:(+)-N-methyl-laurotetanine N-methyllaurotetanine
TypeSmall organic molecule
Emp. Form.C20H23NO4
Mol. Mass.341.4009
SMILESCOc1cc-2c(C[C@@H]3N(C)CCc4cc(OC)c(OC)c-2c34)cc1O