Reaction Details
TargetCytochrome P450 3A4
LigandBDBM50377936
Substrate/Competitorn/a
Meas. Tech.ChEMBL_528535 (CHEMBL972070)
IC50>80000±n/a nM
Citation Gafner, SDietz, BMMcPhail, KLScott, IMGlinski, JARussell, FEMcCollom, MMBudzinski, JWFoster, BCBergeron, CRhyu, MRBolton, JL Alkaloids from Eschscholzia californica and their capacity to inhibit binding of [3H]8-Hydroxy-2-(di-N-propylamino)tetralin to 5-HT1A receptors in Vitro. J Nat Prod69:432-5 (2006) 
 
Cytochrome P450 3A4
Name:Cytochrome P450 3A4
Type:Enzyme
Mol. Mass.:57349.57
Organism:Homo sapiens (Human)
Description:n/a
Residue:503
BDBM50377936
NameBDBM50377936
Synonyms:CALIFORNIDINE
TypeSmall organic molecule
Emp. Form.C21H22NO3
Mol. Mass.336.4037
SMILESC[N+]1(C)[C@H]2Cc3cc4OCOc4cc3[C@@H]1Cc1cc3COCc3cc21