Reaction Details
TargetTyrosine-protein phosphatase non-receptor type 1
LigandBDBM50241796
Substrate/Competitorn/a
Meas. Tech.ChEMBL_527248 (CHEMBL972808)
IC50 26300±n/a nM
Citation Na, MJang, JNjamen, DMbafor, JTFomum, ZTKim, BYOh, WKAhn, JS Protein tyrosine phosphatase-1B inhibitory activity of isoprenylated flavonoids isolated from Erythrina mildbraedii. J Nat Prod69:1572-6 (2006) 
 
Tyrosine-protein phosphatase non-receptor type 1
Name:Tyrosine-protein phosphatase non-receptor type 1
Type:Protein phosphatase
Mol. Mass.:49963.76
Organism:Homo sapiens (Human)
Description:Human recombinant GST-fusion PTP1B (1-435).
Residue:435
BDBM50241796
NameBDBM50241796
Synonyms:4-methylabyssinone V abyssinone-V-4'-O-methyl ether | cid_15382621
TypeSmall organic molecule
Emp. Form.C26H30O5
Mol. Mass.422.5134
SMILES[#6]-[#8]-c1c(-[#6]\[#6]=[#6](\[#6])-[#6])cc(cc1-[#6]\[#6]=[#6](\[#6])-[#6])-[#6@@H]-1-[#6]-[#6](=O)-c2c(-[#8])cc(-[#8])cc2-[#8]-1