Reaction Details
TargetTyrosine-protein phosphatase non-receptor type 1
LigandBDBM50241416
Substrate/Competitorn/a
Meas. Tech.ChEMBL_527248 (CHEMBL972808)
IC50 39700±n/a nM
Citation Na, MJang, JNjamen, DMbafor, JTFomum, ZTKim, BYOh, WKAhn, JS Protein tyrosine phosphatase-1B inhibitory activity of isoprenylated flavonoids isolated from Erythrina mildbraedii. J Nat Prod69:1572-6 (2006) 
 
Tyrosine-protein phosphatase non-receptor type 1
Name:Tyrosine-protein phosphatase non-receptor type 1
Type:Protein phosphatase
Mol. Mass.:49963.76
Organism:Homo sapiens (Human)
Description:Human recombinant GST-fusion PTP1B (1-435).
Residue:435
BDBM50241416
NameBDBM50241416
Synonyms:(2S)-5,7-dihydroxy-2-[4-hydroxy-3,5-bis(3-methylbut-2-en-1-yl)phenyl]-2,3-dihydro-4H-chromen-4-one Abyssinone-V | CHEMBL255890
TypeSmall organic molecule
Emp. Form.C25H28O5
Mol. Mass.408.4868
SMILES[#6]\[#6](-[#6])=[#6]\[#6]-c1cc(cc(-[#6]\[#6]=[#6](\[#6])-[#6])c1-[#8])-[#6@@H]-1-[#6]-[#6](=O)-c2c(-[#8])cc(-[#8])cc2-[#8]-1