Reaction Details
TargetTyrosine-protein phosphatase non-receptor type 1
LigandBDBM50241819
Substrate/Competitorn/a
Meas. Tech.ChEMBL_527248 (CHEMBL972808)
IC50 39200±n/a nM
Citation Na, MJang, JNjamen, DMbafor, JTFomum, ZTKim, BYOh, WKAhn, JS Protein tyrosine phosphatase-1B inhibitory activity of isoprenylated flavonoids isolated from Erythrina mildbraedii. J Nat Prod69:1572-6 (2006) 
 
Tyrosine-protein phosphatase non-receptor type 1
Name:Tyrosine-protein phosphatase non-receptor type 1
Type:Protein phosphatase
Mol. Mass.:49963.76
Organism:Homo sapiens (Human)
Description:Human recombinant GST-fusion PTP1B (1-435).
Residue:435
BDBM50241819
NameBDBM50241819
Synonyms:CHEMBL470655 | sigmoidin E
TypeSmall organic molecule
Emp. Form.C25H26O5
Mol. Mass.406.4709
SMILES[#6]\[#6](-[#6])=[#6]\[#6]-c1cc(cc2-[#6]=[#6]C([#6])([#6])[#8]-c12)-[#6@@H]-1-[#6]-[#6](=O)-c2c(-[#8])cc(-[#8])cc2-[#8]-1