Reaction Details
TargetPlasminogen
LigandBDBM50240943
Substrate/Competitorn/a
Meas. Tech.ChEMBL_526583 (CHEMBL979307)
IC50 2300±n/a nM
Citation Osaki, NKoyano, TKowithayakorn, THayashi, MKomiyama, KIshibashi, M Sesquiterpenoids and plasmin-inhibitory flavonoids from Blumea balsamifera. J Nat Prod68:447-9 (2005) 
 
Plasminogen
Name:Plasminogen
Type:Enzyme
Mol. Mass.:90579.18
Organism:Homo sapiens (Human)
Description:n/a
Residue:810
BDBM50240943
NameBDBM50240943
Synonyms:2-(3,4-Dihydroxy-phenyl)-5-hydroxy-7-methoxy-chromen-4-one CHEMBL183745
TypeSmall organic molecule
Emp. Form.C16H12O6
Mol. Mass.300.2629
SMILESCOc1cc(O)c2c(c1)oc(cc2=O)-c1ccc(O)c(O)c1