Reaction Details
TargetProstaglandin G/H synthase 2
LigandBDBM50009859
Substrate/Competitorn/a
Meas. Tech.ChEMBL_547431 (CHEMBL1026721)
IC50 370000±n/a nM
Citation Noreen, YRingbom, TPerera, PDanielson, HBohlin, L Development of a radiochemical cyclooxygenase-1 and -2 in vitro assay for identification of natural products as inhibitors of prostaglandin biosynthesis. J Nat Prod61:2-7 (1998) 
 
Prostaglandin G/H synthase 2
Name:Prostaglandin G/H synthase 2
Type:Protein
Mol. Mass.:68976.98
Organism:Ovis aries (Sheep)
Description:n/a
Residue:603
BDBM50009859
NameBDBM50009859
Synonyms:(+-)-2-(p-isobutylphenyl)propionic acid (+-)-ibuprofen (4-isobutylphenyl)-alpha-methylacetic acid 2-(4-isobutylphenyl)propanoic acid 4-isobutylhydratropic acid Brufen IBUPROFEN LYSINE Ibuprofen (1) alpha-(4-isobutylphenyl)propionic acid | alpha-(p-isobutylphenyl)propionic acid
TypeSmall organic molecule
Emp. Form.C13H18O2
Mol. Mass.206.2808
SMILESCC(C)Cc1ccc(cc1)C(C)C(O)=O