Reaction Details
TargetSodium-dependent serotonin transporter
LigandBDBM50243139
Substrate/Competitorn/a
Meas. Tech.ChEMBL_492352 (CHEMBL948348)
Ki 113±n/a nM
Citation Jin, CNavarro, HAPage, KCarroll, FI Synthesis and monoamine transporter binding properties of 2beta-[3'-(substituted benzyl)isoxazol-5-yl]- and 2beta-[3'-methyl-4'-(substituted phenyl)isoxazol-5-yl]-3beta-(substituted phenyl)tropanes. Bioorg Med Chem16:6682-8 (2008) 
 
Sodium-dependent serotonin transporter
Name:Sodium-dependent serotonin transporter
Type:Multi-pass membrane protein
Mol. Mass.:70322.51
Organism:Homo sapiens (Human)
Description:P31645
Residue:630
BDBM50243139
NameBDBM50243139
Synonyms:3beta-(4-Methylphenyl)-2beta-[3'-(4-fluorobenzyl)isoxazol-5-yl]-tropanehydrochloride salt | CHEMBL486041
TypeSmall organic molecule
Emp. Form.C25H27FN2O
Mol. Mass.390.4931
SMILESCN1C2CCC1[C@H]([C@H](C2)c1ccc(C)cc1)c1cc(Cc2ccc(F)cc2)no1