Reaction Details
TargetGlutamate receptor ionotropic, NMDA 1
LigandBDBM17657
Substrate/Competitorn/a
Meas. Tech.ChEMBL_487912 (CHEMBL1015731)
EC50 450±n/a nM
Citation Clausen, RPChristensen, CHansen, KBGreenwood, JRJørgensen, LMicale, NMadsen, JCNielsen, BEgebjerg, JBräuner-Osborne, HTraynelis, SFKristensen, JL N-Hydroxypyrazolyl glycine derivatives as selective N-methyl-D-aspartic acid receptor ligands. J Med Chem51:4179-87 (2008) 
 
Glutamate receptor ionotropic, NMDA 1
Name:Glutamate receptor ionotropic, NMDA 1
Type:Enzyme Catalytic Domain
Mol. Mass.:105533.40
Organism:RAT
Description:P35439
Residue:938
BDBM17657
NameBDBM17657
Synonyms:(2S)-2-aminopentanedioic acid D-Glutamate L-Glu L-Glutamic acid L-gluatmate
TypeAmino Acid
Emp. Form.C5H9NO4
Mol. Mass.147.1293
SMILESN[C@@H](CCC(O)=O)C(O)=O