Reaction Details
TargetMitogen-activated protein kinase 14
LigandBDBM50251938
Substrate/Competitorn/a
Meas. Tech.ChEMBL_488009 (CHEMBL1013888)
IC50 70±n/a nM
Citation Laufer, SAHauser, DRDomeyer, DMKinkel, KLiedtke, AJ Design, synthesis, and biological evaluation of novel Tri- and tetrasubstituted imidazoles as highly potent and specific ATP-mimetic inhibitors of p38 MAP kinase: focus on optimized interactions with the enzyme's surface-exposed front region. J Med Chem51:4122-49 (2008) 
 
Mitogen-activated protein kinase 14
Name:Mitogen-activated protein kinase 14
Type:Serine/threonine-protein kinase
Mol. Mass.:41286.76
Organism:Homo sapiens (Human)
Description:Q16539
Residue:360
BDBM50251938
NameBDBM50251938
Synonyms:CHEMBL479991 | {4-[4-(4-Fluoro-phenyl)-3-methyl-2-methylsulfanyl-1H-imidazol-5-yl]-pyridin-2-yl}-((S)-1-phenyl-ethyl)-amine
TypeSmall organic molecule
Emp. Form.C24H23FN4S
Mol. Mass.418.53
SMILESCSc1nc(c(-c2ccnc(N[C@@H](C)c3ccccc3)c2)n1C)-c1ccc(F)cc1