Reaction Details
TargetMitogen-activated protein kinase 14
LigandBDBM50251921
Substrate/Competitorn/a
Meas. Tech.ChEMBL_488009 (CHEMBL1013888)
IC50 11±n/a nM
Citation Laufer, SAHauser, DRDomeyer, DMKinkel, KLiedtke, AJ Design, synthesis, and biological evaluation of novel Tri- and tetrasubstituted imidazoles as highly potent and specific ATP-mimetic inhibitors of p38 MAP kinase: focus on optimized interactions with the enzyme's surface-exposed front region. J Med Chem51:4122-49 (2008) 
 
Mitogen-activated protein kinase 14
Name:Mitogen-activated protein kinase 14
Type:Serine/threonine-protein kinase
Mol. Mass.:41286.76
Organism:Homo sapiens (Human)
Description:Q16539
Residue:360
BDBM50251921
NameBDBM50251921
Synonyms:CHEMBL481749 | trans-4-{4-[2-Methylsulfanyl-4-(3-trifluoromethyl-phenyl)-1H-imidazol-5-yl]-pyridin-2-ylamino}-cyclohexanol
TypeSmall organic molecule
Emp. Form.C22H23F3N4OS
Mol. Mass.448.504
SMILESCSc1nc(c([nH]1)-c1cccc(c1)C(F)(F)F)-c1ccnc(N[C@H]2CC[C@H](O)CC2)c1