Reaction Details
TargetMitogen-activated protein kinase 14
LigandBDBM50251911
Substrate/Competitorn/a
Meas. Tech.ChEMBL_488009 (CHEMBL1013888)
IC50 46±n/a nM
Citation Laufer, SAHauser, DRDomeyer, DMKinkel, KLiedtke, AJ Design, synthesis, and biological evaluation of novel Tri- and tetrasubstituted imidazoles as highly potent and specific ATP-mimetic inhibitors of p38 MAP kinase: focus on optimized interactions with the enzyme's surface-exposed front region. J Med Chem51:4122-49 (2008) 
 
Mitogen-activated protein kinase 14
Name:Mitogen-activated protein kinase 14
Type:Serine/threonine-protein kinase
Mol. Mass.:41286.76
Organism:Homo sapiens (Human)
Description:Q16539
Residue:360
BDBM50251911
NameBDBM50251911
Synonyms:CHEMBL452471 | {4-[4-(4-Fluoro-phenyl)-2-methylsulfanyl-1H-imidazol-5-yl]-pyridin-2-yl}-thiophen-2-ylmethylamine
TypeSmall organic molecule
Emp. Form.C20H17FN4S2
Mol. Mass.396.504
SMILESCSc1nc(c([nH]1)-c1ccc(F)cc1)-c1ccnc(NCc2cccs2)c1