Reaction Details
TargetCannabinoid receptor 1
LigandBDBM50263153
Substrate/Competitorn/a
Meas. Tech.ChEMBL_490516 (CHEMBL981122)
Ki 1900±n/a nM
Citation Urbani, PCascio, MGRamunno, ABisogno, TSaturnino, CDi Marzo, V Novel sterically hindered cannabinoid CB1 receptor ligands. Bioorg Med Chem16:7510-5 (2008) 
 
Cannabinoid receptor 1
Name:Cannabinoid receptor 1
Type:G Protein-Coupled Receptor (GPCR)
Mol. Mass.:52868.96
Organism:Homo sapiens (Human)
Description:P21554
Residue:472
BDBM50263153
NameBDBM50263153
Synonyms:CHEMBL478643 | N-(3-Phenyl)propyl-2-(4-bromophenylacetamide)
TypeSmall organic molecule
Emp. Form.C23H22BrNO
Mol. Mass.408.331
SMILESBrc1ccc(cc1)C(C(=O)NCCCc1ccccc1)c1ccccc1