Reaction Details
TargetCannabinoid receptor 1
LigandBDBM50263035
Substrate/Competitorn/a
Meas. Tech.ChEMBL_490516 (CHEMBL981122)
Ki 2200±n/a nM
Citation Urbani, PCascio, MGRamunno, ABisogno, TSaturnino, CDi Marzo, V Novel sterically hindered cannabinoid CB1 receptor ligands. Bioorg Med Chem16:7510-5 (2008) 
 
Cannabinoid receptor 1
Name:Cannabinoid receptor 1
Type:G Protein-Coupled Receptor (GPCR)
Mol. Mass.:52868.96
Organism:Homo sapiens (Human)
Description:P21554
Residue:472
BDBM50263035
NameBDBM50263035
Synonyms:CHEMBL478625 | N-(3,3-Diphenyl)propyl-2-hydroxy-2,2-diphenylacetamide
TypeSmall organic molecule
Emp. Form.C29H27NO2
Mol. Mass.421.5302
SMILESOC(C(=O)NCCC(c1ccccc1)c1ccccc1)(c1ccccc1)c1ccccc1