Reaction Details
TargetCannabinoid receptor 1
LigandBDBM50263033
Substrate/Competitorn/a
Meas. Tech.ChEMBL_490516 (CHEMBL981122)
Ki 58±n/a nM
Citation Urbani, PCascio, MGRamunno, ABisogno, TSaturnino, CDi Marzo, V Novel sterically hindered cannabinoid CB1 receptor ligands. Bioorg Med Chem16:7510-5 (2008) 
 
Cannabinoid receptor 1
Name:Cannabinoid receptor 1
Type:G Protein-Coupled Receptor (GPCR)
Mol. Mass.:52868.96
Organism:Homo sapiens (Human)
Description:P21554
Residue:472
BDBM50263033
NameBDBM50263033
Synonyms:CHEMBL476529 | N-(3,3-Diphenyl)propyl-2,2-diphenylacetamide
TypeSmall organic molecule
Emp. Form.C29H27NO
Mol. Mass.405.5308
SMILESO=C(NCCC(c1ccccc1)c1ccccc1)C(c1ccccc1)c1ccccc1