Reaction Details
TargetCannabinoid receptor 2
LigandBDBM50263197
Substrate/Competitorn/a
Meas. Tech.ChEMBL_490517 (CHEMBL981123)
Ki 1300±n/a nM
Citation Urbani, PCascio, MGRamunno, ABisogno, TSaturnino, CDi Marzo, V Novel sterically hindered cannabinoid CB1 receptor ligands. Bioorg Med Chem16:7510-5 (2008) 
 
Cannabinoid receptor 2
Name:Cannabinoid receptor 2
Type:G Protein-Coupled Receptor (GPCR)
Mol. Mass.:39690.94
Organism:Homo sapiens (Human)
Description:P34972
Residue:360
BDBM50263197
NameBDBM50263197
Synonyms:CHEMBL517815 | N-(3,3-Diphenyl)propyl-2-(4-bromophenyl) acetamide
TypeSmall organic molecule
Emp. Form.C23H22BrNO
Mol. Mass.408.331
SMILESBrc1ccc(CC(=O)NCCC(c2ccccc2)c2ccccc2)cc1