Reaction Details
TargetCannabinoid receptor 2
LigandBDBM50263154
Substrate/Competitorn/a
Meas. Tech.ChEMBL_490517 (CHEMBL981123)
Ki>7900±n/a nM
Citation Urbani, PCascio, MGRamunno, ABisogno, TSaturnino, CDi Marzo, V Novel sterically hindered cannabinoid CB1 receptor ligands. Bioorg Med Chem16:7510-5 (2008) 
 
Cannabinoid receptor 2
Name:Cannabinoid receptor 2
Type:G Protein-Coupled Receptor (GPCR)
Mol. Mass.:39690.94
Organism:Homo sapiens (Human)
Description:P34972
Residue:360
BDBM50263154
NameBDBM50263154
Synonyms:CHEMBL502133 | N-(3,3-Diphenyl)propyl-2-phenylacetamide
TypeSmall organic molecule
Emp. Form.C23H23NO
Mol. Mass.329.4348
SMILESO=C(Cc1ccccc1)NCCC(c1ccccc1)c1ccccc1