Reaction Details
TargetCannabinoid receptor 2
LigandBDBM50263152
Substrate/Competitorn/a
Meas. Tech.ChEMBL_490517 (CHEMBL981123)
Ki 2400±n/a nM
Citation Urbani, PCascio, MGRamunno, ABisogno, TSaturnino, CDi Marzo, V Novel sterically hindered cannabinoid CB1 receptor ligands. Bioorg Med Chem16:7510-5 (2008) 
 
Cannabinoid receptor 2
Name:Cannabinoid receptor 2
Type:G Protein-Coupled Receptor (GPCR)
Mol. Mass.:39690.94
Organism:Homo sapiens (Human)
Description:P34972
Residue:360
BDBM50263152
NameBDBM50263152
Synonyms:CHEMBL476545 | N-(3-Phenyl)propyl-2-(4-chlorophenyl)-2-phenylacetamide
TypeSmall organic molecule
Emp. Form.C23H22ClNO
Mol. Mass.363.88
SMILESClc1ccc(cc1)C(C(=O)NCCCc1ccccc1)c1ccccc1