Reaction Details
TargetCannabinoid receptor 2
LigandBDBM50263117
Substrate/Competitorn/a
Meas. Tech.ChEMBL_490517 (CHEMBL981123)
Ki 1200±n/a nM
Citation Urbani, PCascio, MGRamunno, ABisogno, TSaturnino, CDi Marzo, V Novel sterically hindered cannabinoid CB1 receptor ligands. Bioorg Med Chem16:7510-5 (2008) 
 
Cannabinoid receptor 2
Name:Cannabinoid receptor 2
Type:G Protein-Coupled Receptor (GPCR)
Mol. Mass.:39690.94
Organism:Homo sapiens (Human)
Description:P34972
Residue:360
BDBM50263117
NameBDBM50263117
Synonyms:2-(4-Aminophenyl)-2-phenyl-N-(3,3-diphenylpropyl)-acetamide | CHEMBL479095
TypeSmall organic molecule
Emp. Form.C29H28N2O
Mol. Mass.420.5454
SMILESNc1ccc(cc1)C(C(=O)NCCC(c1ccccc1)c1ccccc1)c1ccccc1