Reaction Details
TargetCannabinoid receptor 2
LigandBDBM50263115
Substrate/Competitorn/a
Meas. Tech.ChEMBL_490517 (CHEMBL981123)
Ki 790±n/a nM
Citation Urbani, PCascio, MGRamunno, ABisogno, TSaturnino, CDi Marzo, V Novel sterically hindered cannabinoid CB1 receptor ligands. Bioorg Med Chem16:7510-5 (2008) 
 
Cannabinoid receptor 2
Name:Cannabinoid receptor 2
Type:G Protein-Coupled Receptor (GPCR)
Mol. Mass.:39690.94
Organism:Homo sapiens (Human)
Description:P34972
Residue:360
BDBM50263115
NameBDBM50263115
Synonyms:2-(4-Nitrophenyl)-2-phenyl-N-(3,3-diphenylpropyl)-acetamide | CHEMBL479094
TypeSmall organic molecule
Emp. Form.C29H26N2O3
Mol. Mass.450.5283
SMILES[O-][N+](=O)c1ccc(cc1)C(C(=O)NCCC(c1ccccc1)c1ccccc1)c1ccccc1