Reaction Details
TargetNischarin
LigandBDBM50262238
Substrate/Competitorn/a
Meas. Tech.ChEMBL_490890 (CHEMBL989166)
Ki 232±n/a nM
Citation Nikolic, KFilipic, SAgbaba, D QSAR study of imidazoline antihypertensive drugs. Bioorg Med Chem16:7134-40 (2008) 
 
Nischarin
Name:Nischarin
Type:Enzyme
Mol. Mass.:166571.31
Organism:Homo sapiens (Human)
Description:Q9Y2I1
Residue:1504
BDBM50262238
NameBDBM50262238
Synonyms:2-(4-Chloro-1,3-dihydro-isoindol-2-ylamino)-4,5-dihydro-3H-imidazol-1-ium
TypeSmall organic molecule
Emp. Form.C11H14ClN4
Mol. Mass.237.708
SMILESClc1cccc2-[#6]-[#7](-[#6]-c12)\[#7+]=[#6]-1/[#7]-[#6]-[#6]-[#7]-1