Reaction Details
TargetNischarin
LigandBDBM50262235
Substrate/Competitorn/a
Meas. Tech.ChEMBL_490890 (CHEMBL989166)
Ki 59.2±n/a nM
Citation Nikolic, KFilipic, SAgbaba, D QSAR study of imidazoline antihypertensive drugs. Bioorg Med Chem16:7134-40 (2008) 
 
Nischarin
Name:Nischarin
Type:Enzyme
Mol. Mass.:166571.31
Organism:Homo sapiens (Human)
Description:Q9Y2I1
Residue:1504
BDBM50262235
NameBDBM50262235
Synonyms:rilmenidine
TypeSmall organic molecule
Emp. Form.C10H17N2O
Mol. Mass.181.2542
SMILESC1CC1C(NC1=[NH+]CCO1)C1CC1