Reaction Details
TargetNischarin
LigandBDBM50016897
Substrate/Competitorn/a
Meas. Tech.ChEMBL_490890 (CHEMBL989166)
Ki 55±n/a nM
Citation Nikolic, KFilipic, SAgbaba, D QSAR study of imidazoline antihypertensive drugs. Bioorg Med Chem16:7134-40 (2008) 
 
Nischarin
Name:Nischarin
Type:Enzyme
Mol. Mass.:166571.31
Organism:Homo sapiens (Human)
Description:Q9Y2I1
Residue:1504
BDBM50016897
NameBDBM50016897
Synonyms:2-(2,6-dichloroanilino)-1,3-diazacyclopentene-(2) CLONIDINE clonidine (amino form)
TypeSmall organic molecule
Emp. Form.C9H9Cl2N3
Mol. Mass.230.094
SMILESClc1cccc(Cl)c1\[#7]=[#6]-1\[#7]-[#6]-[#6]-[#7]-1