Reaction Details
TargetNociceptin receptor
LigandBDBM50262295
Substrate/Competitorn/a
Meas. Tech.ChEMBL_490896 (CHEMBL989172)
Ki 0.1±n/a nM
Citation Charoenchai, LWang, HWang, JBAldrich, JV High affinity conformationally constrained nociceptin/orphanin FQ(1-13) amide analogues. J Med Chem51:4385-7 (2008) 
 
Nociceptin receptor
Name:Nociceptin receptor
Type:G Protein-Coupled Receptor (GPCR)
Mol. Mass.:40702.87
Organism:Homo sapiens (Human)
Description:P41146
Residue:370
BDBM50262295
NameBDBM50262295
Synonyms:4-[(4R,7S,10S,13R)-10-(3-{[amino(iminiumyl)methyl]amino}propyl)-4-{[(1S)-1-{[(1S)-1-{[(1S)-5-amino-1-carbamoylpentyl]carbamoyl}-4-carbamimidamidobutyl]carbamoyl}ethyl]carbamoyl}-13-{2-[(2S,3R)-2-[(2S)-2-(2-{2-[(2S)-2-amino-3-phenylpropanamido]acetamido}acetamido)-3-phenylpropanamido]-3-hydroxybutanamido]acetamido}-6,9,12-trioxo-1,2-dithia-5,8,11-triazacyclotetradecan-7-yl]butan-1-aminium cyclo [Cys7, Cys10] N/OFQ(1-13)NH2
TypeSmall organic molecule
Emp. Form.C61H100N22O14S2
Mol. Mass.1429.715
SMILES[#6]-[#6@@H](-[#8])-[#6@H](-[#7]-[#6](=O)-[#6@H](-[#6]-c1ccccc1)-[#7]-[#6](=O)-[#6]-[#7]-[#6](=O)-[#6]-[#7]-[#6](=O)-[#6@@H](-[#7])-[#6]-c1ccccc1)-[#6](=O)-[#7]-[#6]-[#6](=O)-[#7]-[#6@H]-1-[#6]-[#16]-[#16]-[#6]-[#6@H](-[#7]-[#6](=O)-[#6@H](-[#6]-[#6]-[#6]-[#6]-[#7+])-[#7]-[#6](=O)-[#6@H](-[#6]-[#6]-[#6]\[#7+]=[#6](\[#7])-[#7])-[#7]-[#6]-1=O)-[#6](=O)-[#7]-[#6@@H](-[#6])-[#6](=O)-[#7]-[#6@@H](-[#6]-[#6]-[#6]\[#7]=[#6](/[#7])-[#7])-[#6](=O)-[#7]-[#6@@H](-[#6]-[#6]-[#6]-[#6]-[#7])-[#6](-[#7])=O