Reaction Details
TargetNociceptin receptor
LigandBDBM50262290
Substrate/Competitorn/a
Meas. Tech.ChEMBL_490893 (CHEMBL989169)
Ki 0.34±n/a nM
Citation Charoenchai, LWang, HWang, JBAldrich, JV High affinity conformationally constrained nociceptin/orphanin FQ(1-13) amide analogues. J Med Chem51:4385-7 (2008) 
 
Nociceptin receptor
Name:Nociceptin receptor
Type:G Protein-Coupled Receptor (GPCR)
Mol. Mass.:40702.87
Organism:Homo sapiens (Human)
Description:P41146
Residue:370
BDBM50262290
NameBDBM50262290
Synonyms:4-[(3S,6S,9S,12S,20S)-6-(3-{[amino(iminiumyl)methyl]amino}propyl)-20-{[(1S)-1-{[(1S)-1-{[(1S)-5-amino-1-carbamoylpentyl]carbamoyl}-4-carbamimidamidobutyl]carbamoyl}ethyl]carbamoyl}-12-[(2S,3R)-2-[(2S)-2-(2-{2-[(2S)-2-amino-3-phenylpropanamido]acetamido}acetamido)-3-phenylpropanamido]-3-hydroxybutanamido]-9-methyl-2,5,8,11,14-pentaoxo-1,4,7,10,15-pentaazacycloicosan-3-yl]butan-1-aminium cyclo [Asp6, Lys10] N/OFQ(1-13)NH2
TypeSmall organic molecule
Emp. Form.C66H109N23O15
Mol. Mass.1464.7157
SMILES[#6]-[#6@@H](-[#8])-[#6@H](-[#7]-[#6](=O)-[#6@H](-[#6]-c1ccccc1)-[#7]-[#6](=O)-[#6]-[#7]-[#6](=O)-[#6]-[#7]-[#6](=O)-[#6@@H](-[#7])-[#6]-c1ccccc1)-[#6](=O)-[#7]-[#6@H]-1-[#6]-[#6](=O)-[#7]-[#6]-[#6]-[#6]-[#6]-[#6@H](-[#7]-[#6](=O)-[#6@H](-[#6]-[#6]-[#6]-[#6]-[#7+])-[#7]-[#6](=O)-[#6@H](-[#6]-[#6]-[#6]\[#7+]=[#6](\[#7])-[#7])-[#7]-[#6](=O)-[#6@H](-[#6])-[#7]-[#6]-1=O)-[#6](=O)-[#7]-[#6@@H](-[#6])-[#6](=O)-[#7]-[#6@@H](-[#6]-[#6]-[#6]\[#7]=[#6](/[#7])-[#7])-[#6](=O)-[#7]-[#6@@H](-[#6]-[#6]-[#6]-[#6]-[#7])-[#6](-[#7])=O