Reaction Details
TargetFatty-acid amide hydrolase 1 [30-579]
LigandBDBM50261990
Substrate/Competitorn/a
Meas. Tech.ChEMBL_513860 (CHEMBL970754)
Ki 0.38±n/a nM
Citation Garfunkle, JEzzili, CRayl, TJHochstatter, DGHwang, IBoger, DL Optimization of the central heterocycle of alpha-ketoheterocycle inhibitors of fatty acid amide hydrolase. J Med Chem51:4392-403 (2008) 
 
Fatty-acid amide hydrolase 1 [30-579]
Name:Fatty-acid amide hydrolase 1 [30-579]
Type:Single-pass membrane protein; homodimer
Mol. Mass.:60474.00
Organism:Rattus norvegicus (rat)
Description:P97612 (aa 30-579)
Residue:550
BDBM50261990
NameBDBM50261990
Synonyms:1-(3-(6-Cyanopiridin-2-yl)-1,2,4-oxadiazol-5-yl)-7-phenylheptan-1-one | CHEMBL469241
TypeSmall organic molecule
Emp. Form.C21H20N4O2
Mol. Mass.360.4091
SMILESO=C(CCCCCCc1ccccc1)c1nc(no1)-c1cccc(n1)C#N