Reaction Details
TargetNeutral cholesterol ester hydrolase 1
LigandBDBM50161511
Substrate/Competitorn/a
Meas. Tech.ChEMBL_513867 (CHEMBL970761)
IC50>100000±n/a nM
Citation Garfunkle, JEzzili, CRayl, TJHochstatter, DGHwang, IBoger, DL Optimization of the central heterocycle of alpha-ketoheterocycle inhibitors of fatty acid amide hydrolase. J Med Chem51:4392-403 (2008) 
 
Neutral cholesterol ester hydrolase 1
Name:Neutral cholesterol ester hydrolase 1
Type:PROTEIN
Mol. Mass.:45810.81
Organism:Homo sapiens (Human)
Description:ChEMBL_835312
Residue:408
BDBM50161511
NameBDBM50161511
Synonyms:1-(5-(Furan-2-yl)-1,3,4-oxadiazol-2-yl)-heptan-1-one 1-[5-(furan-2-yl)-1,3,4-oxadiazol-2-yl]-7-phenylheptan-1-one | CHEMBL426967
TypeSmall organic molecule
Emp. Form.C19H20N2O3
Mol. Mass.324.3737
SMILESO=C(CCCCCCc1ccccc1)c1nnc(o1)-c1ccco1