Reaction Details
TargetFatty-acid amide hydrolase 1 [30-579]
LigandBDBM50261938
Substrate/Competitorn/a
Meas. Tech.ChEMBL_513860 (CHEMBL970754)
IC50 60±n/a nM
Citation Garfunkle, JEzzili, CRayl, TJHochstatter, DGHwang, IBoger, DL Optimization of the central heterocycle of alpha-ketoheterocycle inhibitors of fatty acid amide hydrolase. J Med Chem51:4392-403 (2008) 
 
Fatty-acid amide hydrolase 1 [30-579]
Name:Fatty-acid amide hydrolase 1 [30-579]
Type:Single-pass membrane protein; homodimer
Mol. Mass.:60474.00
Organism:Rattus norvegicus (rat)
Description:P97612 (aa 30-579)
Residue:550
BDBM50261938
NameBDBM50261938
Synonyms:CHEMBL450158 | Methyl 5-(7-Phenylheptanoyl)-1,3,4-thiadiazole-2-carboxylate
TypeSmall organic molecule
Emp. Form.C17H20N2O3S
Mol. Mass.332.417
SMILESCOC(=O)c1nnc(s1)C(=O)CCCCCCc1ccccc1