Reaction Details
TargetAdenylate cyclase type 10
LigandBDBM50262191
Substrate/Competitorn/a
Meas. Tech.ChEMBL_514281 (CHEMBL979111)
IC50 700±n/a nM
Citation Schlicker, CRauch, AHess, KCKachholz, BLevin, LRBuck, JSteegborn, C Structure-based development of novel adenylyl cyclase inhibitors. J Med Chem51:4456-64 (2008) 
 
Adenylate cyclase type 10
Name:Adenylate cyclase type 10
Type:PROTEIN
Mol. Mass.:187169.28
Organism:Homo sapiens (Human)
Description:ChEMBL_514281
Residue:1610
BDBM50262191
NameBDBM50262191
Synonyms:{[(2R,3S,5R)-5-(6-amino-9H-purin-9-yl)-2-methyloxolan-3-yl phosphonato]oxy}(hydrogen phosphonatooxy)phosphinate
TypeSmall organic molecule
Emp. Form.C10H13N5O11P3
Mol. Mass.472.1601
SMILESC[C@H]1O[C@H](C[C@@H]1OP([O-])(=O)OP([O-])(=O)OP(O)([O-])=O)n1cnc2c(N)ncnc12