Reaction Details
TargetEctonucleoside triphosphate diphosphohydrolase 8
LigandBDBM50029031
Substrate/Competitorn/a
Meas. Tech.ChEMBL_514295 (CHEMBL979125)
Ki>100000±n/a nM
Citation Brunschweiger, AIqbal, JUmbach, FScheiff, ABMunkonda, MNSévigny, JKnowles, AFMüller, CE Selective nucleoside triphosphate diphosphohydrolase-2 (NTPDase2) inhibitors: nucleotide mimetics derived from uridine-5'-carboxamide. J Med Chem51:4518-28 (2008) 
 
Ectonucleoside triphosphate diphosphohydrolase 8
Name:Ectonucleoside triphosphate diphosphohydrolase 8
Type:PROTEIN
Mol. Mass.:53895.40
Organism:Homo sapiens (Human)
Description:ChEMBL_514295
Residue:495
BDBM50029031
NameBDBM50029031
Synonyms:1-Amino-4-{4-[4-chloro-6-(3-sulfo-phenylamino)-[1,3,5]triazin-2-ylamino]-3-sulfo-phenylamino}-9,10-dioxo-9,10-dihydro-anthracene-2-sulfonic acid1-Amino-4-{4-[4-chloro-6-(4-sulfo-phenylamino)-[1,3,5]triazin-2-ylamino]-3-sulfo-phenylamino}-9,10-dioxo-9,10-dihydro-anthracene-2-sulfonic acid CID44285648 cibacron blue (mixer, meta and para isomers
TypeSmall organic molecule
Emp. Form.C29H17ClN7O11S3
Mol. Mass.771.135
SMILESNc1c(cc(Nc2ccc(Nc3nc(Cl)nc(Nc4cccc(c4)S([O-])(=O)=O)n3)c(c2)S([O-])(=O)=O)c2C(=O)c3ccccc3C(=O)c12)S([O-])(=O)=O