Reaction Details
TargetEctonucleoside triphosphate diphosphohydrolase 2
LigandBDBM50262252
Substrate/Competitorn/a
Meas. Tech.ChEMBL_514542 (CHEMBL968896)
IC50 374000±n/a nM
Citation Brunschweiger, AIqbal, JUmbach, FScheiff, ABMunkonda, MNSévigny, JKnowles, AFMüller, CE Selective nucleoside triphosphate diphosphohydrolase-2 (NTPDase2) inhibitors: nucleotide mimetics derived from uridine-5'-carboxamide. J Med Chem51:4518-28 (2008) 
 
Ectonucleoside triphosphate diphosphohydrolase 2
Name:Ectonucleoside triphosphate diphosphohydrolase 2
Type:PROTEIN
Mol. Mass.:53675.44
Organism:Homo sapiens (Human)
Description:ChEMBL_1453714
Residue:495
BDBM50262252
NameBDBM50262252
Synonyms:2-[(2S,3R,4S,5R)-5-(2,4-Dioxo-3,4-dihydropyrimidin-1(2H)-yl)-3,4-dihydroxytetrahydrofurane-2-carboxamido]ethylamidomethylphosphonic acid diethyl ester | CHEMBL468354
TypeSmall organic molecule
Emp. Form.C16H25N4O10P
Mol. Mass.464.3643
SMILESCCOP(=O)(CNC(=O)CNC(=O)[C@H]1O[C@H]([C@H](O)[C@@H]1O)n1ccc(=O)[nH]c1=O)OCC