Reaction Details
TargetP2Y purinoceptor 4
LigandBDBM50262422
Substrate/Competitorn/a
Meas. Tech.ChEMBL_514536 (CHEMBL968890)
IC50 73000±n/a nM
Citation Brunschweiger, AIqbal, JUmbach, FScheiff, ABMunkonda, MNSévigny, JKnowles, AFMüller, CE Selective nucleoside triphosphate diphosphohydrolase-2 (NTPDase2) inhibitors: nucleotide mimetics derived from uridine-5'-carboxamide. J Med Chem51:4518-28 (2008) 
 
P2Y purinoceptor 4
Name:P2Y purinoceptor 4
Type:PROTEIN
Mol. Mass.:40977.17
Organism:Homo sapiens (Human)
Description:ChEMBL_751027
Residue:365
BDBM50262422
NameBDBM50262422
Synonyms:CHEMBL477339 | sodium (E)-4-((3-formyl-4-hydroxy-5-methyl-2-(phosphonatooxymethyl)phenyl)diazenyl)benzene-1,3-disulfonate
TypeSmall organic molecule
Emp. Form.C15H11N2O12PS2
Mol. Mass.506.36
SMILESCc1cc(N=Nc2ccc(cc2S([O-])(=O)=O)S([O-])(=O)=O)c(COP([O-])([O-])=O)c(C=O)c1O