Reaction Details
TargetAdenosine receptor A2a
LigandBDBM50108022
Substrate/Competitorn/a
Meas. Tech.ChEMBL_513609 (CHEMBL967913)
Ki 0.12±n/a nM
Citation Mantri, Mde Graaf, Ovan Veldhoven, JGöblyös, Avon Frijtag Drabbe Künzel, JKMulder-Krieger, TLink, Rde Vries, HBeukers, MWBrussee, JIjzerman, AP 2-Amino-6-furan-2-yl-4-substituted nicotinonitriles as A2A adenosine receptor antagonists. J Med Chem51:4449-55 (2008) 
 
Adenosine receptor A2a
Name:Adenosine receptor A2a
Type:G Protein-Coupled Receptor (GPCR)
Mol. Mass.:44716.46
Organism:Homo sapiens (Human)
Description:P29274
Residue:412
BDBM50108022
NameBDBM50108022
Synonyms:4-(2-(5-amino-2-(furan-2-yl)-7H-pyrazolo[4,3-e][1,2,4]triazolo[1,5-c]pyrimidin-7-yl)ethyl)-N,N-bis(2-hydroxyethyl)benzenesulfonamide CHEMBL22717
TypeSmall organic molecule
Emp. Form.C22H24N8O5S
Mol. Mass.512.542
SMILESNc1nc2n(CCc3ccc(cc3)S(=O)(=O)N(CCO)CCO)ncc2c2nc(nn12)-c1ccco1