Reaction Details
TargetAdenosine receptor A2a
LigandBDBM50173176
Substrate/Competitorn/a
Meas. Tech.ChEMBL_513609 (CHEMBL967913)
Ki 1±n/a nM
Citation Mantri, Mde Graaf, Ovan Veldhoven, JGöblyös, Avon Frijtag Drabbe Künzel, JKMulder-Krieger, TLink, Rde Vries, HBeukers, MWBrussee, JIjzerman, AP 2-Amino-6-furan-2-yl-4-substituted nicotinonitriles as A2A adenosine receptor antagonists. J Med Chem51:4449-55 (2008) 
 
Adenosine receptor A2a
Name:Adenosine receptor A2a
Type:G Protein-Coupled Receptor (GPCR)
Mol. Mass.:44716.46
Organism:Homo sapiens (Human)
Description:P29274
Residue:412
BDBM50173176
NameBDBM50173176
Synonyms:8-Amino-2-furan-2-yl-[1,2,4]triazolo[1,5-a]pyrazine-6-carboxylic acid [2-(4-hydroxy-phenyl)-ethyl]-amide N-(4-hydroxyphenethyl)-8-amino-2-(furan-2-yl)-[1,2,4]triazolo[1,5-a]pyrazine-6-carboxamide
TypeSmall organic molecule
Emp. Form.C18H16N6O3
Mol. Mass.364.358
SMILESNc1nc(cn2nc(nc12)-c1ccco1)C(=O)NCCc1ccc(O)cc1