Reaction Details
TargetAdenosine receptor A2a
LigandBDBM50262441
Substrate/Competitorn/a
Meas. Tech.ChEMBL_509569 (CHEMBL1000455)
Ki 1±n/a nM
Citation Mantri, Mde Graaf, Ovan Veldhoven, JGöblyös, Avon Frijtag Drabbe Künzel, JKMulder-Krieger, TLink, Rde Vries, HBeukers, MWBrussee, JIjzerman, AP 2-Amino-6-furan-2-yl-4-substituted nicotinonitriles as A2A adenosine receptor antagonists. J Med Chem51:4449-55 (2008) 
 
Adenosine receptor A2a
Name:Adenosine receptor A2a
Type:G Protein-Coupled Receptor (GPCR)
Mol. Mass.:44716.46
Organism:Homo sapiens (Human)
Description:P29274
Residue:412
BDBM50262441
NameBDBM50262441
Synonyms:2-Amino-4,6-di-furan-2-yl-nicotinonitrile | CHEMBL506250
TypeSmall organic molecule
Emp. Form.C14H9N3O2
Mol. Mass.251.2402
SMILESNc1nc(cc(-c2ccco2)c1C#N)-c1ccco1