Reaction Details
TargetAdenosine receptor A2a
LigandBDBM50262436
Substrate/Competitorn/a
Meas. Tech.ChEMBL_509569 (CHEMBL1000455)
Ki 1.4±n/a nM
Citation Mantri, Mde Graaf, Ovan Veldhoven, JGöblyös, Avon Frijtag Drabbe Künzel, JKMulder-Krieger, TLink, Rde Vries, HBeukers, MWBrussee, JIjzerman, AP 2-Amino-6-furan-2-yl-4-substituted nicotinonitriles as A2A adenosine receptor antagonists. J Med Chem51:4449-55 (2008) 
 
Adenosine receptor A2a
Name:Adenosine receptor A2a
Type:G Protein-Coupled Receptor (GPCR)
Mol. Mass.:44716.46
Organism:Homo sapiens (Human)
Description:P29274
Residue:412
BDBM50262436
NameBDBM50262436
Synonyms:2-Amino-4-thiophen-2-yl-6-furan-2-yl-nicotinonitrile | CHEMBL476311
TypeSmall organic molecule
Emp. Form.C14H9N3OS
Mol. Mass.267.306
SMILESNc1nc(cc(-c2cccs2)c1C#N)-c1ccco1