Reaction Details
TargetKappa-type opioid receptor
LigandBDBM50245093
Substrate/Competitorn/a
Meas. Tech.ChEMBL_513622 (CHEMBL970713)
Ki 3290±n/a nM
Citation Sakami, SMaeda, MKawai, KAoki, TKawamura, KFujii, HHasebe, KNakajima, MEndo, TUeno, SIto, TKamei, JNagase, H Structure-antitussive activity relationships of naltrindole derivatives. Identification of novel and potent antitussive agents. J Med Chem51:4404-11 (2008) 
 
Kappa-type opioid receptor
Name:Kappa-type opioid receptor
Type:G Protein-Coupled Receptor (GPCR)
Mol. Mass.:42744.99
Organism:Cavia porcellus (domestic guinea pig)
Description:P41144
Residue:380
BDBM50245093
NameBDBM50245093
Synonyms:(5R,9R,13S,14S)-17-cyclopropylmethyl-6,7-didehydro-4,5-epoxy-5',6'-dihydro-3-methoxy-4'H-pyrrolo[3,2,1-ij]quinolino[2',1':6,7]morphinan-14-ol methanesulfonate | CHEMBL504916
TypeSmall organic molecule
Emp. Form.C30H32N2O3
Mol. Mass.468.5867
SMILESCOc1ccc2C[C@H]3N(CC4CC4)CC[C@@]45[C@@H](Oc1c24)c1c(C[C@@]35O)c2cccc3CCCn1c23