Reaction Details
TargetMu-type opioid receptor
LigandBDBM50261726
Substrate/Competitorn/a
Meas. Tech.ChEMBL_513621 (CHEMBL970712)
Ki 113±n/a nM
Citation Sakami, SMaeda, MKawai, KAoki, TKawamura, KFujii, HHasebe, KNakajima, MEndo, TUeno, SIto, TKamei, JNagase, H Structure-antitussive activity relationships of naltrindole derivatives. Identification of novel and potent antitussive agents. J Med Chem51:4404-11 (2008) 
 
Mu-type opioid receptor
Name:Mu-type opioid receptor
Type:Enzyme Catalytic Domain
Mol. Mass.:11165.58
Organism:GUINEA PIG
Description:P97266
Residue:98
BDBM50261726
NameBDBM50261726
Synonyms:(5R,9R,13S,14S)-17-Cyclopropylmethyl-6,7-didehydro-4,5-epoxy-4',5',6',7'-tetradehydro-azepino[3,2,1-hi]indolo[2',1':6,7]morphinan-3,14-diol | CHEMBL469027
TypeSmall organic molecule
Emp. Form.C30H32N2O3
Mol. Mass.468.5867
SMILESOc1ccc2C[C@H]3N(CC4CC4)CC[C@@]45[C@@H](Oc1c24)c1c(C[C@@]35O)c2cccc3CCCCn1c23