Reaction Details
TargetMu-type opioid receptor
LigandBDBM50244419
Substrate/Competitorn/a
Meas. Tech.ChEMBL_513621 (CHEMBL970712)
Ki 60.6±n/a nM
Citation Sakami, SMaeda, MKawai, KAoki, TKawamura, KFujii, HHasebe, KNakajima, MEndo, TUeno, SIto, TKamei, JNagase, H Structure-antitussive activity relationships of naltrindole derivatives. Identification of novel and potent antitussive agents. J Med Chem51:4404-11 (2008) 
 
Mu-type opioid receptor
Name:Mu-type opioid receptor
Type:Enzyme Catalytic Domain
Mol. Mass.:11165.58
Organism:GUINEA PIG
Description:P97266
Residue:98
BDBM50244419
NameBDBM50244419
Synonyms:(4bS,8R,8aS,16bR)-7-(cyclopropylmethyl)-5,6,7,8,8a,9,13,14,15,16b-decahydro-4,8-methanobenzofuro[2,3-a]dipyrido[4,3-b:3',2',1'-jk]carbazole-1,8a-diol CHEMBL520557
TypeSmall organic molecule
Emp. Form.C29H30N2O3
Mol. Mass.454.5601
SMILESOc1ccc2C[C@H]3N(CC4CC4)CC[C@@]45[C@@H](Oc1c24)c1c(C[C@@]35O)c2cccc3CCCn1c23