Reaction Details
TargetAcetylcholinesterase
LigandBDBM29400
Substrate/Competitorn/a
Meas. Tech.ChEMBL_514381 (CHEMBL967995)
IC50 110±n/a nM
Citation León, Rde los Ríos, CMarco-Contelles, JHuertas, OBarril, XLuque, FJLópez, MGGarcía, AGVillarroya, M New tacrine-dihydropyridine hybrids that inhibit acetylcholinesterase, calcium entry, and exhibit neuroprotection properties. Bioorg Med Chem16:7759-69 (2008) 
 
Acetylcholinesterase
Name:Acetylcholinesterase
Type:Enzyme
Mol. Mass.:67792.70
Organism:Homo sapiens (Human)
Description:P22303
Residue:614
BDBM29400
NameBDBM29400
Synonyms:CHEMBL374184 | tacrine-dihydropyridine hybrid (tacripyrine), 11
TypeSmall organic molecule
Emp. Form.C23H27N3O3
Mol. Mass.393.4788
SMILESCCOC(=O)C1C(c2ccc(OC)cc2)c2c(N)c3CCCCc3nc2N=C1C