Reaction Details
TargetAcetylcholinesterase
LigandBDBM29391
Substrate/Competitorn/a
Meas. Tech.ChEMBL_514381 (CHEMBL967995)
IC50 190±n/a nM
Citation León, Rde los Ríos, CMarco-Contelles, JHuertas, OBarril, XLuque, FJLópez, MGGarcía, AGVillarroya, M New tacrine-dihydropyridine hybrids that inhibit acetylcholinesterase, calcium entry, and exhibit neuroprotection properties. Bioorg Med Chem16:7759-69 (2008) 
 
Acetylcholinesterase
Name:Acetylcholinesterase
Type:Enzyme
Mol. Mass.:67792.70
Organism:Homo sapiens (Human)
Description:P22303
Residue:614
BDBM29391
NameBDBM29391
Synonyms:CHEMBL219172 | tacrine-dihydropyridine hybrid (tacripyrine), 2
TypeSmall organic molecule
Emp. Form.C22H24FN3O2
Mol. Mass.381.4433
SMILESCCOC(=O)C1C(c2ccc(F)cc2)c2c(N)c3CCCCc3nc2N=C1C