Reaction Details
TargetCholinesterase
LigandBDBM50262339
Substrate/Competitorn/a
Meas. Tech.ChEMBL_514382 (CHEMBL967996)
IC50>100000±n/a nM
Citation León, Rde los Ríos, CMarco-Contelles, JHuertas, OBarril, XLuque, FJLópez, MGGarcía, AGVillarroya, M New tacrine-dihydropyridine hybrids that inhibit acetylcholinesterase, calcium entry, and exhibit neuroprotection properties. Bioorg Med Chem16:7759-69 (2008) 
 
Cholinesterase
Name:Cholinesterase
Type:Homotetramer
Mol. Mass.:68422.27
Organism:Homo sapiens (Human)
Description:P06276
Residue:602
BDBM50262339
NameBDBM50262339
Synonyms:11-Amino-12-(4-fluoro-phenyl)-3,3-dimethyl-3,4,5,7,8,9,10,12-octahydro-2H-dibenzo[b,g][1,8]naphthyridin-1-one | CHEMBL468000
TypeSmall organic molecule
Emp. Form.C24H26FN3O
Mol. Mass.391.4811
SMILESCC1(C)CC(=O)C2C(c3ccc(F)cc3)c3c(N)c4CCCCc4nc3N=C2C1