Reaction Details
TargetAcetylcholinesterase
LigandBDBM50262454
Substrate/Competitorn/a
Meas. Tech.ChEMBL_514380 (CHEMBL967994)
IC50 49000±n/a nM
Citation León, Rde los Ríos, CMarco-Contelles, JHuertas, OBarril, XLuque, FJLópez, MGGarcía, AGVillarroya, M New tacrine-dihydropyridine hybrids that inhibit acetylcholinesterase, calcium entry, and exhibit neuroprotection properties. Bioorg Med Chem16:7759-69 (2008) 
 
Acetylcholinesterase
Name:Acetylcholinesterase
Type:Enzyme
Mol. Mass.:71812.79
Organism:Electrophorus electricus (Electric eel)
Description:n/a
Residue:633
BDBM50262454
NameBDBM50262454
Synonyms:11-Amino-3,3-dimethyl-12-phenyl-2,3,4,7,8,9,10,12-octahydro-5-oxa-6-aza-naphthacen-1-one | CHEMBL478000
TypeSmall organic molecule
Emp. Form.C24H26N2O2
Mol. Mass.374.4754
SMILESCC1(C)CC(=O)C2=C(C1)Oc1nc3CCCCc3c(N)c1C2c1ccccc1