Reaction Details
TargetAcetylcholinesterase
LigandBDBM50241350
Substrate/Competitorn/a
Meas. Tech.ChEMBL_514380 (CHEMBL967994)
IC50 820±n/a nM
Citation León, Rde los Ríos, CMarco-Contelles, JHuertas, OBarril, XLuque, FJLópez, MGGarcía, AGVillarroya, M New tacrine-dihydropyridine hybrids that inhibit acetylcholinesterase, calcium entry, and exhibit neuroprotection properties. Bioorg Med Chem16:7759-69 (2008) 
 
Acetylcholinesterase
Name:Acetylcholinesterase
Type:Enzyme
Mol. Mass.:71812.79
Organism:Electrophorus electricus (Electric eel)
Description:n/a
Residue:633
BDBM50241350
NameBDBM50241350
Synonyms:5-Amino-2-methyl-4-phenyl-6,7,8,9-tetrahydro-benzo[b][1,8]naphthyridine-3-carboxylic acid ethyl ester ethyl 5-amino-2-methyl-4-phenyl-6,7,8,9-tetrahydrobenzo[b][1,8]naphthyridine-3-carboxylate
TypeSmall organic molecule
Emp. Form.C22H23N3O2
Mol. Mass.361.4369
SMILESCCOC(=O)c1c(C)nc2nc3CCCCc3c(N)c2c1-c1ccccc1