Reaction Details
TargetAcetylcholinesterase
LigandBDBM50241346
Substrate/Competitorn/a
Meas. Tech.ChEMBL_514380 (CHEMBL967994)
IC50 870±n/a nM
Citation León, Rde los Ríos, CMarco-Contelles, JHuertas, OBarril, XLuque, FJLópez, MGGarcía, AGVillarroya, M New tacrine-dihydropyridine hybrids that inhibit acetylcholinesterase, calcium entry, and exhibit neuroprotection properties. Bioorg Med Chem16:7759-69 (2008) 
 
Acetylcholinesterase
Name:Acetylcholinesterase
Type:Enzyme
Mol. Mass.:71812.79
Organism:Electrophorus electricus (Electric eel)
Description:n/a
Residue:633
BDBM50241346
NameBDBM50241346
Synonyms:10-Amino-4-(4-methoxy-phenyl)-2-methyl-5,6,7,8-tetrahydro-4H-1-oxa-9-aza-anthracene-3-carboxylic acid ethyl ester ethyl 5-amino-4-(4-methoxyphenyl)-2-methyl-6,7,8,9-tetrahydro-4H-pyrano[2,3-b]quinoline-3-carboxylate
TypeSmall organic molecule
Emp. Form.C23H26N2O4
Mol. Mass.394.4635
SMILESCCOC(=O)C1=C(C)Oc2nc3CCCCc3c(N)c2C1c1ccc(OC)cc1