Reaction Details
TargetAcetylcholinesterase
LigandBDBM50262342
Substrate/Competitorn/a
Meas. Tech.ChEMBL_514384 (CHEMBL970795)
Ki 157±n/a nM
Citation León, Rde los Ríos, CMarco-Contelles, JHuertas, OBarril, XLuque, FJLópez, MGGarcía, AGVillarroya, M New tacrine-dihydropyridine hybrids that inhibit acetylcholinesterase, calcium entry, and exhibit neuroprotection properties. Bioorg Med Chem16:7759-69 (2008) 
 
Acetylcholinesterase
Name:Acetylcholinesterase
Type:Enzyme
Mol. Mass.:71812.79
Organism:Electrophorus electricus (Electric eel)
Description:n/a
Residue:633
BDBM50262342
NameBDBM50262342
Synonyms:11-Amino-3,3-dimethyl-12-pyridin-4-yl-3,4,5,7,8,9,10,12-octahydro-2H-dibenzo[b,g][1,8]naphthyridin-1-one | CHEMBL468002
TypeSmall organic molecule
Emp. Form.C23H26N4O
Mol. Mass.374.4787
SMILESCC1(C)CC(=O)C2C(c3ccncc3)c3c(N)c4CCCCc4nc3N=C2C1